BDBM50347333 CHEMBL1796996
SMILES COc1ccc(cc1)-c1ccc(Cn2c3c(C(=O)CCNC3=O)c3ccccc23)cc1
InChI Key InChIKey=IFXSGNXICHOBJG-UHFFFAOYSA-N
Data  1 IC50
  Tab Delimited (TSV)   2D SDfile   Computed 3D by Vconf -m prep SDfile
Find this compound or compounds like it in BindingDB:
Activity Spreadsheet -- Enzyme Inhibition Constant Data from BindingDB
Found 1 hit for monomerid = 50347333
TargetTyrosine-protein phosphatase non-receptor type 1(Homo sapiens (Human))
Sun Yat-Sen University
Curated by ChEMBL
LigandPNGBDBM50347333(CHEMBL1796996)
Affinity DataIC50:  1.39E+4nM. Assay description: Inhibition of human recombinant PTP1B assessed as inhibition of para-nitrophenyl phosphate to para-nitrophenol conversion by spectrophotometry
In DepthDetails ArticlePubMed