BDBM50350487 CHEMBL1814635
SMILES Cc1cc(Cc2sc(=O)[nH]c2O)cc(C)c1O
InChI Key InChIKey=PFAVTOHWHIEEMA-UHFFFAOYSA-N
Data  3 IC50
  Tab Delimited (TSV)   2D SDfile   Computed 3D by Vconf -m prep SDfile
Find this compound or compounds like it in BindingDB:
Activity Spreadsheet -- Enzyme Inhibition Constant Data from BindingDB
Found 3 hits for monomerid = 50350487
TargetCDGSH iron-sulfur domain-containing protein 1(Homo sapiens (Human))
Northeast Ohio Medical University
Curated by ChEMBL
LigandPNGBDBM50350487(CHEMBL1814635)
Affinity DataIC50:  9.56E+3nM. Assay description: Displacement of [3H]-rosiglitazone from human recombinant C-terminal His-tagged cytosolic domain of mitoNEET (32-108) by scintillation proximity assa...
In DepthDetails ArticlePubMed
TargetAmine oxidase [flavin-containing] A(Homo sapiens (Human))
Northeastern Ohio Universities Colleges Of Medicine And Pharmacy
Curated by ChEMBL
LigandPNGBDBM50350487(CHEMBL1814635)
Affinity DataIC50:  2.62E+4nM. Assay description: Inhibition of human recombinant MAOA assessed as inhibition of kynuramine conversion to fluorescent metabolite 4-hydroxyquinoline by fluorimetry
In DepthDetails ArticlePubMed
TargetAmine oxidase [flavin-containing] B(Homo sapiens (Human))
Northeastern Ohio Universities Colleges Of Medicine And Pharmacy
Curated by ChEMBL
LigandPNGBDBM50350487(CHEMBL1814635)
Affinity DataIC50:  1.61E+4nM. Assay description: Inhibition of human recombinant MAOB by amplex red assay
In DepthDetails ArticlePubMed