BDBM50350497 CHEMBL1814649
SMILES OC1=NC(=O)C(S1)=CC(=O)Nc1ccccc1
InChI Key InChIKey=NAXSBLRSPVANEC-UHFFFAOYSA-N
Data  3 IC50
  Tab Delimited (TSV)   2D SDfile   Computed 3D by Vconf -m prep SDfile
Find this compound or compounds like it in BindingDB:
Activity Spreadsheet -- Enzyme Inhibition Constant Data from BindingDB
Found 3 hits for monomerid = 50350497
TargetCDGSH iron-sulfur domain-containing protein 1(Homo sapiens (Human))
Northeast Ohio Medical University
Curated by ChEMBL
LigandPNGBDBM50350497(CHEMBL1814649)
Affinity DataIC50:  1.11E+4nM. Assay description: Displacement of [3H]-rosiglitazone from human recombinant C-terminal His-tagged cytosolic domain of mitoNEET (32-108) by scintillation proximity assa...
In DepthDetails ArticlePubMed
TargetAmine oxidase [flavin-containing] A(Homo sapiens (Human))
Northeastern Ohio Universities Colleges Of Medicine And Pharmacy
Curated by ChEMBL
LigandPNGBDBM50350497(CHEMBL1814649)
Affinity DataIC50:  3.53E+4nM. Assay description: Inhibition of human recombinant MAOA assessed as inhibition of kynuramine conversion to fluorescent metabolite 4-hydroxyquinoline by fluorimetry
In DepthDetails ArticlePubMed
TargetAmine oxidase [flavin-containing] B(Homo sapiens (Human))
Northeastern Ohio Universities Colleges Of Medicine And Pharmacy
Curated by ChEMBL
LigandPNGBDBM50350497(CHEMBL1814649)
Affinity DataIC50:  2.20E+4nM. Assay description: Inhibition of human recombinant MAOB by amplex red assay
In DepthDetails ArticlePubMed