BDBM50350697 CHEMBL1814820
SMILES Cc1cc(=O)[nH]c(=O)n1[C@H]1C[C@H](OP(N)(=O)OC[C@H]2O[C@H](C[C@@H]2OP(N)(=O)OC[C@@H]2C[C@@H](OP(N)(=O)OC[C@H]3O[C@H](C[C@@H]3OP(N)(=O)OC[C@H](COP(N)(=O)OC[C@H]3O[C@H](C[C@@H]3OP(N)(=O)OC[C@H]3O[C@H](C[C@@H]3OP(N)(=O)OC[C@H]3O[C@H](C[C@@H]3OP(N)(=O)OC[C@H]3O[C@H](C[C@@H]3OP(N)(=O)OC[C@H]3O[C@H](C[C@@H]3OP(N)(=O)OC[C@H]3O[C@H](C[C@@H]3OP(N)(=O)OC[C@H]3O[C@H](C[C@@H]3OP(N)(=O)OC[C@H]3O[C@H](C[C@@H]3O)n3cnc4c3nc(N)[nH]c4=O)n3cnc4c3nc(N)[nH]c4=O)n3cc(C)c(=O)[nH]c3=O)n3cc(C)c(=O)[nH]c3=O)n3cnc4c3nc(N)[nH]c4=O)n3cnc4c3nc(N)[nH]c4=O)n3cc(C)c(=O)[nH]c3=O)n3cnc4c3nc(N)[nH]c4=O)O[C@H](CN3CCNCC3)n3ccc(=O)[nH]c3=O)n3cnc4c3nc(N)[nH]c4=O)[C@@H](O2)n2cnc3c2nc(N)[nH]c3=O)n2cc(C)c(=O)[nH]c2=O)[C@@H](COP(N)(=O)O[C@H]2C[C@@H](O[C@@H]2COP(N)(=O)O[C@H]2C[C@@H](O[C@@H]2COC(=O)CCCC[C@@H]2SC[C@@H]3NC(=O)N[C@H]23)n2cnc3c2nc(N)[nH]c3=O)n2cnc3c2nc(N)[nH]c3=O)O1
InChI Key InChIKey=ZRTNVHMBUFEFRD-YDBHJCPYSA-N
Data  1 Kd
  Tab Delimited (TSV)   2D SDfile   Computed 3D by Vconf -m prep SDfile
Find this compound or compounds like it in BindingDB:
Activity Spreadsheet -- Enzyme Inhibition Constant Data from BindingDB
Found 1 hit for monomerid = 50350697
TargetProthrombin(Homo sapiens (Human))
University Of Southern Denmark
Curated by ChEMBL
LigandPNGBDBM50350697(CHEMBL1814820)
Affinity DataKd:  52.6nM. Assay description: Binding affinity to thrombin at 37 degC by isothermal titration calorimetry
In DepthDetails ArticlePubMed