BDBM50351412 CHEMBL1819094
SMILES CCOc1ccc(Cc2cc3[C@@H]4O[C@H](COCCCOc3cc2Cl)[C@@H](O)[C@H](O)[C@H]4O)cc1
InChI Key InChIKey=UDZOMCSFZYQATQ-SJSRKZJXSA-N
Data  2 IC50
  Tab Delimited (TSV)   2D SDfile   Computed 3D by Vconf -m prep SDfile
Find this compound or compounds like it in BindingDB:
Activity Spreadsheet -- Enzyme Inhibition Constant Data from BindingDB
Found 2 hits for monomerid = 50351412
TargetSodium/glucose cotransporter 2(Homo sapiens (Human))
Green Cross
Curated by ChEMBL
LigandPNGBDBM50351412(CHEMBL1819094)
Affinity DataIC50:  2.95nM. Assay description: Inhibition of human SGLT2 expressed in CHO cells assessed as reduction of [14C]-labeled AMG after 2 hrs by liquid scintillation counting
In DepthDetails ArticlePubMed
TargetSodium/glucose cotransporter 2(Homo sapiens (Human))
Green Cross
Curated by ChEMBL
LigandPNGBDBM50351412(CHEMBL1819094)
Affinity DataIC50:  2.95nMpH: 7.4 T: 2°C. Assay description: For sodium-dependent glucose transport assay, cells expressing hSGLT2 were seeded into a 96-well culture plate at a density of 5x104 cells/well in RP...
In DepthDetails US Patent