BDBM50351432 CHEMBL1819486
SMILES CCc1ccc(Cc2ccccc2O[C@@H]2C[C@H](CO)[C@@H](O)[C@H](O)[C@H]2O)cc1
InChI Key InChIKey=XVPAOSPCPFGRSC-IWTFSIHTSA-N
Data  2 IC50
  Tab Delimited (TSV)   2D SDfile   Computed 3D by Vconf -m prep SDfile
Find this compound or compounds like it in BindingDB:
Activity Spreadsheet -- Enzyme Inhibition Constant Data from BindingDB
Found 2 hits for monomerid = 50351432
TargetSodium/glucose cotransporter 1(Homo sapiens (Human))
Chugai Pharmaceutical
Curated by ChEMBL
LigandPNGBDBM50351432(CHEMBL1819486)
Affinity DataIC50:  4.80E+3nM. Assay description: Inhibition of human SGLT1 expressed in CHO cells assessed as [14C]AMG uptake after 45 mins
In DepthDetails ArticlePubMed
TargetSolute carrier family 5 member 4(Homo sapiens (Human))
Chugai Pharmaceutical
Curated by ChEMBL
LigandPNGBDBM50351432(CHEMBL1819486)
Affinity DataIC50:  28nM. Assay description: Inhibition of human SGLT2 expressed in CHO cells assessed as [14C]AMG uptake after 45 mins
In DepthDetails ArticlePubMed