BDBM50351524 CHEMBL1824660
SMILES CCCc1cc(ccn1)-c1nc(cs1)-c1ccc(F)cc1
InChI Key InChIKey=QKZNZFDVQQFDLV-UHFFFAOYSA-N
Data  1 IC50
  Tab Delimited (TSV)   2D SDfile   Computed 3D by Vconf -m prep SDfile
Find this compound or compounds like it in BindingDB:
Activity Spreadsheet -- Enzyme Inhibition Constant Data from BindingDB
Found 1 hit for monomerid = 50351524
TargetSterol regulatory element-binding protein 2(Homo sapiens (Human))
Kyoto University
Curated by ChEMBL
LigandPNGBDBM50351524(CHEMBL1824660)
Affinity DataIC50:  1.24E+4nM. Assay description: Inhibition of SREBP2 activation expressed in CHO-K1 cells cotransfected with pSRE-Luc plasmid assessed as inhibition of luciferase expression after 2...
In DepthDetails ArticlePubMed