BDBM50352035 CHEMBL1823809
SMILES CCCN1C(=O)S\C(=C\c2ccncc2)C1=O
InChI Key InChIKey=SGIZZQKMDAUFPA-CSKARUKUSA-N
Data  1 IC50
  Tab Delimited (TSV)   2D SDfile   Computed 3D by Vconf -m prep SDfile
Find this compound or compounds like it in BindingDB:
Activity Spreadsheet -- Enzyme Inhibition Constant Data from BindingDB
Found 1 hit for monomerid = 50352035
TargetCDGSH iron-sulfur domain-containing protein 1(Homo sapiens (Human))
Northeast Ohio Medical University
Curated by ChEMBL
LigandPNGBDBM50352035(CHEMBL1823809)
Affinity DataIC50:  1.94E+4nM. Assay description: Displacement of [3H]-rosiglitazone from human recombinant C-terminal His-tagged cytosolic domain of mitoNEET (32-108) by scintillation proximity assa...
In DepthDetails ArticlePubMed