BDBM50353909 CHEMBL1830648
SMILES CC(C)[C@H](NC(=O)[C@@H]1Cc2ccccc2CN1)C(=O)NO
InChI Key InChIKey=UNLNLYQBKRFQHT-STQMWFEESA-N
Data  2 IC50
  Tab Delimited (TSV)   2D SDfile   Computed 3D by Vconf -m prep SDfile
Find this compound or compounds like it in BindingDB:
Activity Spreadsheet -- Enzyme Inhibition Constant Data from BindingDB
Found 2 hits for monomerid = 50353909
Target72 kDa type IV collagenase(Homo sapiens (Human))
Shandong University
Curated by ChEMBL
LigandPNGBDBM50353909(CHEMBL1830648)
Affinity DataIC50:  3.07E+5nM. Assay description: Inhibition of MMP2 after 30 mins
In DepthDetails ArticlePubMed
TargetAminopeptidase N(Sus scrofa (Pig))
Shandong University
Curated by ChEMBL
LigandPNGBDBM50353909(CHEMBL1830648)
Affinity DataIC50:  3.66E+4nM. Assay description: Inhibition of pig kidney microsome aminopeptidase N using L-Leu-p-nitroanilide substrate
In DepthDetails ArticlePubMed