BDBM50354018 CHEMBL1830514
SMILES CCCN(CCC)c1cc(nc2ccnn12)N(COC)c1ccc(OC)cc1Cl
InChI Key InChIKey=BHKGCOKSBGNTIE-UHFFFAOYSA-N
Data  1 IC50  1 EC50
  Tab Delimited (TSV)   2D SDfile   Computed 3D by Vconf -m prep SDfile
Find this compound or compounds like it in BindingDB:
Activity Spreadsheet -- Enzyme Inhibition Constant Data from BindingDB
Found 2 hits for monomerid = 50354018
TargetCorticotropin-releasing factor receptor 1(Homo sapiens (Human))
Minase Research Institute
Curated by ChEMBL
LigandPNGBDBM50354018(CHEMBL1830514)
Affinity DataEC50:  4.40nM. Assay description: Antagonist activity at human CRF1 receptor expressed in CHO-K1 cells assessed as inhibition of CRF-induced cAMP accumulation after 15 mins by cAMP en...
In DepthDetails ArticlePubMed
TargetCorticotropin-releasing factor receptor 1(Homo sapiens (Human))
Minase Research Institute
Curated by ChEMBL
LigandPNGBDBM50354018(CHEMBL1830514)
Affinity DataIC50:  15nM. Assay description: Displacement of [125I]-CRF from human CRF1 receptor expressed in CHO-K1 cells after 2 hrs by gamma counting
In DepthDetails ArticlePubMed