BDBM50355756 CHEMBL1909658
SMILES CO[C@H]1\C=C\O[C@@]2(C)Oc3c(C2=O)c2C(=O)C(\C=N\N4CCN(C)CC4)=C(NC(=O)\C(C)=C/C=C/[C@H](C)[C@H](O)[C@@H](C)[C@@H](O)[C@@H](C)[C@H](OC(C)=O)[C@@H]1C)C(=O)c2c(O)c3C
InChI Key InChIKey=IHHAOHNZEKYBLG-WLSIYKJHSA-N
Data  1 IC50
  Tab Delimited (TSV)   2D SDfile   Computed 3D by Vconf -m prep SDfile
Find this compound or compounds like it in BindingDB:
Activity Spreadsheet -- Enzyme Inhibition Constant Data from BindingDB
Found 1 hit for monomerid = 50355756
TargetDNA-directed RNA polymerase subunit beta(Mycobacterium tuberculosis)
University Of Michigan
Curated by ChEMBL
LigandPNGBDBM50355756(CHEMBL1909658)
Affinity DataIC50:  13nM. Assay description: Inhibition of wild type Mycobacterium tuberculosis RNA polymerase after 10 mins using ribo green staining by rolling circle transcription assay
In DepthDetails ArticlePubMed