BDBM50356209 CHEMBL1910466
SMILES CC(C)[C@@H](NS(=O)(=O)c1ccc(cc1)-c1ccc(OCc2ccnc(C)c2)cc1)C(O)=O
InChI Key InChIKey=CPBYLQSCRDREEZ-HSZRJFAPSA-N
Data  2 IC50
  Tab Delimited (TSV)   2D SDfile   Computed 3D by Vconf -m prep SDfile
Find this compound or compounds like it in BindingDB:
Activity Spreadsheet -- Enzyme Inhibition Constant Data from BindingDB
Found 2 hits for monomerid = 50356209
TargetCollagenase 3(Homo sapiens (Human))
Pfizer
Curated by ChEMBL
LigandPNGBDBM50356209(CHEMBL1910466)
Affinity DataIC50:  0.700nM. Assay description: Inhibition of MMP13
In DepthDetails ArticlePubMed
LigandPNGBDBM50356209(CHEMBL1910466)
Affinity DataIC50:  2.40E+3nM. Assay description: Inhibition of aggrecanase-1
In DepthDetails ArticlePubMed