BDBM50356814 CHEMBL1914780
SMILES CN[C@@H]1CCN(C1)c1nc(N)nc2c1oc1cccc(OC)c21
InChI Key InChIKey=VDGVJXWKUDSPGG-SECBINFHSA-N
Data  1 KI
  Tab Delimited (TSV)   2D SDfile   Computed 3D by Vconf -m prep SDfile
Find this compound or compounds like it in BindingDB:
Activity Spreadsheet -- Enzyme Inhibition Constant Data from BindingDB
Found 1 hit for monomerid = 50356814
TargetHistamine H4 receptor(Homo sapiens (Human))
Johnson & Johnson Pharmaceutical Research & Development
Curated by ChEMBL
LigandPNGBDBM50356814(CHEMBL1914780)
Affinity DataKi:  20nM. Assay description: Displacement of [3H]histamine from recombinant human histamine H4 receptor
In DepthDetails ArticlePubMed