BDBM50356824 CHEMBL1914790
SMILES CN[C@@H]1CCN(C1)c1nc(N)nc2c3cc(F)ccc3sc12
InChI Key InChIKey=GOBPOEPRCOWZKN-SECBINFHSA-N
Data  1 KI
  Tab Delimited (TSV)   2D SDfile   Computed 3D by Vconf -m prep SDfile
Find this compound or compounds like it in BindingDB:
Activity Spreadsheet -- Enzyme Inhibition Constant Data from BindingDB
Found 1 hit for monomerid = 50356824
TargetHistamine H4 receptor(Homo sapiens (Human))
Johnson & Johnson Pharmaceutical Research & Development
Curated by ChEMBL
LigandPNGBDBM50356824(CHEMBL1914790)
Affinity DataKi:  31nM. Assay description: Displacement of [3H]histamine from recombinant human histamine H4 receptor
In DepthDetails ArticlePubMed