BDBM50356972 CHEMBL1916234
SMILES CCOC(=O)N1CCC(CC1)N1CCC[C@H](C1)NC(=O)c1ccccc1Cl
InChI Key InChIKey=VSYRZNVEBYAZBF-OAHLLOKOSA-N
Data  5 EC50
  Tab Delimited (TSV)   2D SDfile   Computed 3D by Vconf -m prep SDfile
Find this compound or compounds like it in BindingDB:
Activity Spreadsheet -- Enzyme Inhibition Constant Data from BindingDB
Found 5 hits for monomerid = 50356972
TargetMuscarinic acetylcholine receptor M2(RAT)
Vanderbilt University Medical Center
Curated by ChEMBL
LigandPNGBDBM50356972(CHEMBL1916234)
Affinity DataEC50: >1.00E+4nM. Assay description: Agonist activity at rat muscarinic M2 receptor expressed in CHO cells
In DepthDetails ArticlePubMed
TargetMuscarinic acetylcholine receptor M3(RAT)
Vanderbilt University Medical Center
Curated by ChEMBL
LigandPNGBDBM50356972(CHEMBL1916234)
Affinity DataEC50: >1.00E+4nM. Assay description: Agonist activity at rat muscarinic M3 receptor expressed in CHO cells
In DepthDetails ArticlePubMed
TargetMuscarinic acetylcholine receptor M1(RAT)
Vanderbilt University Medical Center
Curated by ChEMBL
LigandPNGBDBM50356972(CHEMBL1916234)
Affinity DataEC50:  2.60E+3nM. Assay description: Agonist activity at rat muscarinic M1 receptor expressed in CHO cells
In DepthDetails ArticlePubMed
TargetMuscarinic acetylcholine receptor M5(RAT)
Vanderbilt University Medical Center
Curated by ChEMBL
LigandPNGBDBM50356972(CHEMBL1916234)
Affinity DataEC50: >1.00E+4nM. Assay description: Agonist activity at rat muscarinic M5 receptor expressed in CHO cells
In DepthDetails ArticlePubMed
TargetMuscarinic acetylcholine receptor M4(RAT)
Vanderbilt University Medical Center
Curated by ChEMBL
LigandPNGBDBM50356972(CHEMBL1916234)
Affinity DataEC50: >1.00E+4nM. Assay description: Agonist activity at rat muscarinic M4 receptor expressed in CHO cells
In DepthDetails ArticlePubMed