BDBM50357033 CHEMBL1916657
SMILES CC(C)CCN([C@H](Cc1ccc(O)cc1)C(=O)NO)S(=O)(=O)c1ccc2ccccc2c1
InChI Key InChIKey=IMCGJWBSANDEHB-HSZRJFAPSA-N
Data  2 IC50
  Tab Delimited (TSV)   2D SDfile   Computed 3D by Vconf -m prep SDfile
Find this compound or compounds like it in BindingDB:
Activity Spreadsheet -- Enzyme Inhibition Constant Data from BindingDB
Found 2 hits for monomerid = 50357033
Target72 kDa type IV collagenase(Homo sapiens (Human))
Novartis Institutes For Biomedical Research
Curated by ChEMBL
LigandPNGBDBM50357033(CHEMBL1916657)
Affinity DataIC50:  706nM. Assay description: Inhibition of MMP2
In DepthDetails ArticlePubMed
TargetCollagenase 3(Homo sapiens (Human))
Novartis Institutes For Biomedical Research
Curated by ChEMBL
LigandPNGBDBM50357033(CHEMBL1916657)
Affinity DataIC50:  28nM. Assay description: Inhibition of MMP13
In DepthDetails ArticlePubMed