BDBM50357477 CHEMBL1917908
SMILES CCC(C)[C@]1(CCN([C@@H](CCc2ccccc2)C(=O)N[C@@H](Cc2cc(F)cc(F)c2)[C@H](O)[C@@H]2Cc3cccc(OC)c3CN2)C1=O)NC(C)=O
InChI Key InChIKey=PBXQNTXVQOUXNO-LMIINJILSA-N
Data  1 IC50
  Tab Delimited (TSV)   2D SDfile   Computed 3D by Vconf -m prep SDfile
Find this compound or compounds like it in BindingDB:
Activity Spreadsheet -- Enzyme Inhibition Constant Data from BindingDB
Found 1 hit for monomerid = 50357477
TargetBeta-secretase 1(Homo sapiens (Human))
Bristol-Myers Squibb Research And Development
Curated by ChEMBL
LigandPNGBDBM50357477(CHEMBL1917908)
Affinity DataIC50:  140nM. Assay description: Inhibition of BACE-1
In DepthDetails ArticlePubMed