BDBM50358673 CHEMBL1922025
SMILES COc1ccc(Nc2nc(Nc3ccc(OC)c(F)c3)cc(n2)N2CCCN(CC2)C(=O)OC(C)(C)C)cc1
InChI Key InChIKey=DGAHYYLIRNCMBX-UHFFFAOYSA-N
Data  2 IC50
  Tab Delimited (TSV)   2D SDfile   Computed 3D by Vconf -m prep SDfile
Find this compound or compounds like it in BindingDB:
Activity Spreadsheet -- Enzyme Inhibition Constant Data from BindingDB
Found 2 hits for monomerid = 50358673
TargetGalanin receptor type 2(Homo sapiens (Human))
The Scripps Research Institute
Curated by ChEMBL
LigandPNGBDBM50358673(CHEMBL1922025)
Affinity DataIC50:  9.07E+3nM. Assay description: Displacement of [125I]galanin from GalR2 by gamma counting
In DepthDetails ArticlePubMed
TargetGalanin receptor type 1(Homo sapiens (Human))
The Scripps Research Institute
Curated by ChEMBL
LigandPNGBDBM50358673(CHEMBL1922025)
Affinity DataIC50:  2.82E+3nM. Assay description: Displacement of [125I]galanin from GalR1 by gamma counting
In DepthDetails ArticlePubMed