BDBM50358677 CHEMBL1922007
SMILES COc1ccc(Nc2nc(Nc3ccc(OC(F)(F)F)cc3)cc(n2)N2CCCCC2)cc1
InChI Key InChIKey=IEPZREPGCVYQOI-UHFFFAOYSA-N
Data  1 IC50
  Tab Delimited (TSV)   2D SDfile   Computed 3D by Vconf -m prep SDfile
Find this compound or compounds like it in BindingDB:
Activity Spreadsheet -- Enzyme Inhibition Constant Data from BindingDB
Found 1 hit for monomerid = 50358677
TargetGalanin receptor type 2(Homo sapiens (Human))
The Scripps Research Institute
Curated by ChEMBL
LigandPNGBDBM50358677(CHEMBL1922007)
Affinity DataIC50:  330nM. Assay description: Displacement of [125I]galanin from GalR2 by gamma counting
In DepthDetails ArticlePubMed