BDBM50358679 CHEMBL1922009
SMILES COc1ccc(Nc2nc(Nc3cccc(OC(F)F)c3)cc(n2)N2CCCCC2)cc1
InChI Key InChIKey=HSGACOSXIJOBFW-UHFFFAOYSA-N
Data  1 IC50
  Tab Delimited (TSV)   2D SDfile   Computed 3D by Vconf -m prep SDfile
Find this compound or compounds like it in BindingDB:
Activity Spreadsheet -- Enzyme Inhibition Constant Data from BindingDB
Found 1 hit for monomerid = 50358679
TargetGalanin receptor type 2(Homo sapiens (Human))
The Scripps Research Institute
Curated by ChEMBL
LigandPNGBDBM50358679(CHEMBL1922009)
Affinity DataIC50:  540nM. Assay description: Displacement of [125I]galanin from GalR2 by gamma counting
In DepthDetails ArticlePubMed