BDBM50358895 CHEMBL1923571
SMILES COc1ccccc1-c1ccc2cnc(Nc3ccc(cc3)C(=O)N3CCOCC3)nn12
InChI Key InChIKey=VFKPLCLOSWACIS-UHFFFAOYSA-N
Data  1 IC50
  Tab Delimited (TSV)   2D SDfile   Computed 3D by Vconf -m prep SDfile
Find this compound or compounds like it in BindingDB:
Activity Spreadsheet -- Enzyme Inhibition Constant Data from BindingDB
Found 1 hit for monomerid = 50358895
TargetTyrosine-protein kinase JAK2(Homo sapiens (Human))
Cephalon
Curated by ChEMBL
LigandPNGBDBM50358895(CHEMBL1923571)
Affinity DataIC50:  0.170nM. Assay description: Inhibition of human recombinant JAK2 using biotinyl-amino-hexanoyl-EQEDEPEGDYFEWLE-amide as substrate after 20 mins by fluorescence assay
In DepthDetails ArticlePubMed