BDBM50358906 CHEMBL1923582
SMILES CN(c1ccccc1-c1ccc2cnc(Nc3ccc(N4CCN(C)CC4)c(Cl)c3)nn12)S(C)(=O)=O
InChI Key InChIKey=YKWILWXFQSULJA-UHFFFAOYSA-N
Data  1 IC50
  Tab Delimited (TSV)   2D SDfile   Computed 3D by Vconf -m prep SDfile
Find this compound or compounds like it in BindingDB:
Activity Spreadsheet -- Enzyme Inhibition Constant Data from BindingDB
Found 1 hit for monomerid = 50358906
TargetTyrosine-protein kinase JAK2(Homo sapiens (Human))
Cephalon
Curated by ChEMBL
LigandPNGBDBM50358906(CHEMBL1923582)
Affinity DataIC50:  1.10nM. Assay description: Inhibition of human recombinant JAK2 using biotinyl-amino-hexanoyl-EQEDEPEGDYFEWLE-amide as substrate after 20 mins by fluorescence assay
In DepthDetails ArticlePubMed