BDBM50359220 CHEMBL1923315
SMILES CCN1C2=NC(C)(C)CN2c2c(nc(-c3ccc(nc3)-c3ccccc3OC)n2Cc2ccc(F)c(F)c2)C1=O
InChI Key InChIKey=OGRQQJOARNZDSY-UHFFFAOYSA-N
Data  1 IC50
  Tab Delimited (TSV)   2D SDfile   Computed 3D by Vconf -m prep SDfile
Find this compound or compounds like it in BindingDB:
Activity Spreadsheet -- Enzyme Inhibition Constant Data from BindingDB
Found 1 hit for monomerid = 50359220
TargetP2X purinoceptor 7(Homo sapiens (Human))
Merck Research Laboratories
Curated by ChEMBL
LigandPNGBDBM50359220(CHEMBL1923315)
Affinity DataIC50:  101nM. Assay description: Antagonist activity at P2X7 receptor in LPS-stimulated human whole blood assessed as inhibition of ATP-induced IL1-beta production treated 30 mins be...
In DepthDetails ArticlePubMed