BDBM50359504 CHEMBL1927027
SMILES COc1cccc(C[C@@H](C)N)c1
InChI Key InChIKey=VEJWNIYARKAHFI-MRVPVSSYSA-N
Data  1 EC50
  Tab Delimited (TSV)   2D SDfile   Computed 3D by Vconf -m prep SDfile
Find this compound or compounds like it in BindingDB:
Activity Spreadsheet -- Enzyme Inhibition Constant Data from BindingDB
Found 1 hit for monomerid = 50359504
TargetTrace amine-associated receptor 1(Homo sapiens (Human))
Research Triangle Institute
Curated by ChEMBL
LigandPNGBDBM50359504(CHEMBL1927027)
Affinity DataEC50:  6.50E+3nM. Assay description: Activation of C-terminal HA epitope tagged human TAAR1 expressed in RD-HGA16 cells co-expressing Gq protein, Galpha16 by cAMP accumulation assay
In DepthDetails ArticlePubMed