BDBM50359928 CHEMBL1926963
SMILES CCOC(=O)Sc1nc2cc(c(Cl)cc2s1)-n1nc(oc1=O)C(C)(C)C
InChI Key InChIKey=KKBLLOYWQIAELP-UHFFFAOYSA-N
Data  3 KI
  Tab Delimited (TSV)   2D SDfile   Computed 3D by Vconf -m prep SDfile
Find this compound or compounds like it in BindingDB:
Activity Spreadsheet -- Enzyme Inhibition Constant Data from BindingDB
Found 3 hits for monomerid = 50359928
TargetProtoporphyrinogen oxidase(Homo sapiens (Human))
Central China Normal University
Curated by ChEMBL
LigandPNGBDBM50359928(CHEMBL1926963)
Affinity DataKi:  330nM. Assay description: Inhibition of human PPO by capillary electrophoresis method
In DepthDetails ArticlePubMed
TargetProtoporphyrinogen oxidase(Homo sapiens (Human))
Central China Normal University
Curated by ChEMBL
LigandPNGBDBM50359928(CHEMBL1926963)
Affinity DataKi:  330nM. Assay description: Inhibition of Homo sapiens (human) recombinant protoporphyrinogen oxidase expressed in Escherichia coli JM109 assessed as oxidation of protoporphyrin...
In DepthDetails ArticlePubMed
TargetProtoporphyrinogen oxidase(Homo sapiens (Human))
Central China Normal University
Curated by ChEMBL
LigandPNGBDBM50359928(CHEMBL1926963)
Affinity DataKi:  331nM. Assay description: Inhibition of Homo sapiens (human) recombinant protoporphyrinogen oxidase expressed in Escherichia coli JM109 assessed as oxidation of protoporphyrin...
In DepthDetails ArticlePubMed