BDBM50360579 CHEMBL1933163
SMILES O=C(Nc1nccc(n1)-c1cc2c([nH]1)C1(CCNCC1)CNC2=O)c1ccc2ccccc2c1
InChI Key InChIKey=VTSGFJSEVNWKKI-UHFFFAOYSA-N
Data  1 EC50
  Tab Delimited (TSV)   2D SDfile   Computed 3D by Vconf -m prep SDfile
Find this compound or compounds like it in BindingDB:
Activity Spreadsheet -- Enzyme Inhibition Constant Data from BindingDB
Found 1 hit for monomerid = 50360579
TargetMAP kinase-activated protein kinase 2(Homo sapiens (Human))
Merck Research Laboratories
Curated by ChEMBL
LigandPNGBDBM50360579(CHEMBL1933163)
Affinity DataEC50:  5.10nM. Assay description: Inhibition of MK2 using Fluo-betaA-11A NeoMPS as substrate pre-incubated for 30 mins before substrate addition measured after 2 hrs by IMAP assay
In DepthDetails ArticlePubMed