BDBM50362418 CHEMBL1938418
SMILES COc1ccc(cc1)C1(CCC1)N[C@@H]1CC[C@@H]([C@H](C1)c1ccsc1)C(=O)N1CCN(CC1)c1nc2ccc(F)cc2o1
InChI Key InChIKey=CRVUJSZHQDCFMW-FPNNDXFKSA-N
Data  2 IC50
  Tab Delimited (TSV)   2D SDfile   Computed 3D by Vconf -m prep SDfile
Find this compound or compounds like it in BindingDB:
Activity Spreadsheet -- Enzyme Inhibition Constant Data from BindingDB
Found 2 hits for monomerid = 50362418
TargetNeuropeptides B/W receptor type 1(Mus musculus)
Merck
Curated by ChEMBL
LigandPNGBDBM50362418(CHEMBL1938418)
Affinity DataIC50:  0.180nM. Assay description: Displacement of [125]-hNPW23 from mouse NPBWR1 expressed in CHO-K1 cells membrane by scintillation proximity assay
In DepthDetails ArticlePubMed
TargetNeuropeptides B/W receptor type 1(Mus musculus)
Merck
Curated by ChEMBL
LigandPNGBDBM50362418(CHEMBL1938418)
Affinity DataIC50:  1.30nM. Assay description: Antagonist activity at mouse NPBWR1 expressed in CHO-K1 cells assessed as inhibition of hNPW23 and forskolin-stimulated cAMP production after 1 hr by...
In DepthDetails ArticlePubMed