BDBM50362876 CHEMBL1940737
SMILES COc1cc2c(C)c(OC)c(=O)oc2cc1OCCCCOc1cc(O)cc(c1)N(C)C
InChI Key InChIKey=XPLUXJZLCXRYPW-UHFFFAOYSA-N
Data  1 IC50
  Tab Delimited (TSV)   2D SDfile   Computed 3D by Vconf -m prep SDfile
Find this compound or compounds like it in BindingDB:
Activity Spreadsheet -- Enzyme Inhibition Constant Data from BindingDB
Found 1 hit for monomerid = 50362876
TargetAcetylcholinesterase(Homo sapiens (Human))
Punjabi University
Curated by ChEMBL
LigandPNGBDBM50362876(CHEMBL1940737)
Affinity DataIC50:  275nM. Assay description: Inhibition of AChE
In DepthDetails ArticlePubMed