BDBM50363059 CHEMBL1946964
SMILES OC(=O)Cn1c2c(CCN(Cc3ccc(Br)cc3)C2=S)c2ccccc12
InChI Key InChIKey=NCOJBOIGJDFUFH-UHFFFAOYSA-N
Data  3 IC50
  Tab Delimited (TSV)   2D SDfile   Computed 3D by Vconf -m prep SDfile
Find this compound or compounds like it in BindingDB:
Activity Spreadsheet -- Enzyme Inhibition Constant Data from BindingDB
Found 3 hits for monomerid = 50363059
TargetAldo-keto reductase family 1 member B10(Homo sapiens (Human))
University Of Toyama
Curated by ChEMBL
LigandPNGBDBM50363059(CHEMBL1946964)
Affinity DataIC50:  850nM. Assay description: Inhibition of recombinant N-His6-tagged AKR1B10 expressed in Escherichia coli BL21 cells using pyridine-3-aldehyde as substrate by spectrophotometry
In DepthDetails ArticlePubMed
TargetAldo-keto reductase family 1 member B1(Homo sapiens (Human))
University Of Toyama
Curated by ChEMBL
LigandPNGBDBM50363059(CHEMBL1946964)
Affinity DataIC50:  5.90E+3nM. Assay description: Inhibition of human recombinant AKR1B1 expressed in Escherichia coli BL21 cells using pyridine-3-aldehyde as substrate by spectrophotometry
In DepthDetails ArticlePubMed
TargetAldo-keto reductase family 1 member A1(Homo sapiens (Human))
University Of Toyama
Curated by ChEMBL
LigandPNGBDBM50363059(CHEMBL1946964)
Affinity DataIC50:  1.40E+4nM. Assay description: Inhibition of human recombinant AKR1A1 expressed in Escherichia coli BL21 cells using D-glucuronate as substrate by spectrophotometry
In DepthDetails ArticlePubMed