BDBM50363253 CHEMBL1946804
SMILES COc1cc(N2CCN(C)CC2)c2CCc3ccc(N(C)S(C)(=O)=O)c(Nc4nc(Nc1c2)ncc4Cl)c3
InChI Key InChIKey=UMZYPCNQAPVNGF-UHFFFAOYSA-N
Data  2 IC50
  Tab Delimited (TSV)   2D SDfile   Computed 3D by Vconf -m prep SDfile
Find this compound or compounds like it in BindingDB:
Activity Spreadsheet -- Enzyme Inhibition Constant Data from BindingDB
Found 2 hits for monomerid = 50363253
TargetALK tyrosine kinase receptor(Homo sapiens (Human))
Cephalon
Curated by ChEMBL
LigandPNGBDBM50363253(CHEMBL1946804)
Affinity DataIC50:  10nM. Assay description: Inhibition of NPM-ALK autophosphorylation in human ALCL SUP-M2 cells after 2 to 3 hrs by sandwich ELISA
In DepthDetails ArticlePubMed
TargetALK tyrosine kinase receptor(Homo sapiens (Human))
Cephalon
Curated by ChEMBL
LigandPNGBDBM50363253(CHEMBL1946804)
Affinity DataIC50:  0.510nM. Assay description: Inhibition of baculovirus expressed GST-tagged human ALK cytoplasmic domain using PLCgamma as substrate after 15 mins by time-resolved fluorescence a...
In DepthDetails ArticlePubMed