BDBM50364907 CHEMBL1950138
SMILES CCN(CC)CC#Cc1ccc2-c3ccc(cc3C(=O)c2c1)C#CCN(CC)CC
InChI Key InChIKey=SEYBVAXQEGLZJV-UHFFFAOYSA-N
Data  1 KI
  Tab Delimited (TSV)   2D SDfile   Computed 3D by Vconf -m prep SDfile
Find this compound or compounds like it in BindingDB:
Activity Spreadsheet -- Enzyme Inhibition Constant Data from BindingDB
Found 1 hit for monomerid = 50364907
TargetNeuronal acetylcholine receptor subunit alpha-7(Rattus norvegicus (Rat))
Abbott Laboratories
Curated by ChEMBL
LigandPNGBDBM50364907(CHEMBL1950138)
Affinity DataKi:  87nM. Assay description: Displacement of [3H]methyllylcaconitine from alpha7 nAChR in rat brain
In DepthDetails ArticlePubMed