BDBM50366199 CHEMBL1957597
SMILES ONC(=O)[C@@H]1CCCN1S(=O)(=O)c1ccc(cc1)-c1ccccc1
InChI Key InChIKey=XYGPNXMBVTVKDQ-INIZCTEOSA-N
Data  2 IC50
  Tab Delimited (TSV)   2D SDfile   Computed 3D by Vconf -m prep SDfile
Find this compound or compounds like it in BindingDB:
Activity Spreadsheet -- Enzyme Inhibition Constant Data from BindingDB
Found 2 hits for monomerid = 50366199
Target72 kDa type IV collagenase(Homo sapiens (Human))
Colosseum Combinatorial Chemistry Centre For Technology (C4T Scarl)
Curated by ChEMBL
LigandPNGBDBM50366199(CHEMBL1957597)
Affinity DataIC50:  4.00E+3nM. Assay description: Inhibition of full length MMP2 using Mca-Pro-Leu-Gly-Leu-Dpa-Ala-Arg-NH2 as substrate preincubated for 1 hr prior substrate addition measured after 3...
In DepthDetails ArticlePubMed
TargetMatrix metalloproteinase-9(Homo sapiens (Human))
Colosseum Combinatorial Chemistry Centre For Technology (C4T Scarl)
Curated by ChEMBL
LigandPNGBDBM50366199(CHEMBL1957597)
Affinity DataIC50:  7.60E+4nM. Assay description: Inhibition of MMP9 catalytic domain using Mca-Pro-Leu-Gly-Leu-Dpa-Ala-Arg-NH2 as substrate preincubated for 1 hr prior substrate addition measured af...
In DepthDetails ArticlePubMed