BDBM50366288 CHEMBL1159463
SMILES O[C@@H]1[C@@H](COC(=O)c2cc(O)c(O)c(O)c2)O[C@H](OC(=O)c2cc(O)c(O)c(O)c2)[C@H](OC(=O)c2cc(O)c(O)c(O)c2)[C@H]1OC(=O)c1cc(O)c(O)c(O)c1
InChI Key InChIKey=RATQVALKDAUZBW-UEKZKNBCSA-N
Data  2 IC50
  Tab Delimited (TSV)   2D SDfile   Computed 3D by Vconf -m prep SDfile
Find this compound or compounds like it in BindingDB:
Activity Spreadsheet -- Enzyme Inhibition Constant Data from BindingDB
Found 2 hits for monomerid = 50366288
TargetGenome polyprotein(Hepatitis C virus)
Peking University
Curated by ChEMBL
LigandPNGBDBM50366288(CHEMBL1159463)
Affinity DataIC50:  750nM. Assay description: Inhibitory activity against Hepatitis C virus NS3 protease by ELISA
In DepthDetails ArticlePubMed