BDBM50366442 CHEMBL1790414
SMILES CCCNC(=O)[C@@H](NC(=O)[C@@H]1CCCCN1C(=O)[C@H](CC(O)=O)NC(=O)[C@@H]1CCCN1C(=O)[C@H](CCCCN)NC(=O)C[C@H](C)C1CCCCC1)[C@@H](C)O
InChI Key InChIKey=YFYFXERIECOUAV-GLWKFGRTSA-N
Data  1 IC50
  Tab Delimited (TSV)   2D SDfile   Computed 3D by Vconf -m prep SDfile
Find this compound or compounds like it in BindingDB:
Activity Spreadsheet -- Enzyme Inhibition Constant Data from BindingDB
Found 1 hit for monomerid = 50366442
TargetHLA class II histocompatibility antigen, DR beta 3 chain(Homo sapiens (Human))
TBA
Curated by ChEMBL
LigandPNGBDBM50366442(CHEMBL1790414)
Affinity DataIC50:  1.60E+4nM. Assay description: Ability to compete for binding to Class II MHC using ELISA assay.
In DepthDetails Article