BDBM50366741 CHEMBL1793974
SMILES CC[C@H](C)[C@@H]1NC(=O)[C@H](CCOc2ccccc2)NC(=O)[C@H](CCCCCC(=O)CC)NC(=O)[C@H]2CCCCN2C1=O
InChI Key InChIKey=HWYVSKGWENBBBO-IDSWSEBSSA-N
Data  2 IC50
  Tab Delimited (TSV)   2D SDfile   Computed 3D by Vconf -m prep SDfile
Find this compound or compounds like it in BindingDB:
Activity Spreadsheet -- Enzyme Inhibition Constant Data from BindingDB
Found 2 hits for monomerid = 50366741
TargetHistone deacetylase(Homo sapiens (Human))
Merck Research Laboratories
Curated by ChEMBL
LigandPNGBDBM50366741(CHEMBL1793974)
Affinity DataIC50:  34nM. Assay description: Inhibitory activity against histone deacetylase (HDAC) enzyme derived from partially purified extracts of human HeLa cells using [3H]11 as radioligan...
In DepthDetails ArticlePubMed
TargetHistone deacetylase(Cryptosporidium parvum)
Merck Research Laboratories
Curated by ChEMBL
LigandPNGBDBM50366741(CHEMBL1793974)
Affinity DataIC50:  3nM. Assay description: Inhibitory activity against histone deacetylase enzyme derived from partially purified extracts of Eimeria tenella protozoa using [3H]11 as radioliga...
In DepthDetails ArticlePubMed