BDBM50366747 CHEMBL1793975
SMILES CC[C@H](C)[C@@H]1NC(=O)[C@H](Cc2c(Br)[nH]c3ccccc23)NC(=O)[C@H](CCCCCC(=O)CC)NC(=O)[C@H]2CCCCN2C1=O
InChI Key InChIKey=WSPZAXPNRNZYQV-SOJMTTIHSA-N
Data  1 IC50
  Tab Delimited (TSV)   2D SDfile   Computed 3D by Vconf -m prep SDfile
Find this compound or compounds like it in BindingDB:
Activity Spreadsheet -- Enzyme Inhibition Constant Data from BindingDB
Found 1 hit for monomerid = 50366747
TargetHistone deacetylase(Cryptosporidium parvum)
Merck Research Laboratories
Curated by ChEMBL
LigandPNGBDBM50366747(CHEMBL1793975)
Affinity DataIC50:  200nM. Assay description: Inhibitory activity against histone deacetylase enzyme derived from partially purified extracts of Eimeria tenella protozoa using [3H]11 as radioliga...
In DepthDetails ArticlePubMed