BDBM50366972 CHEMBL3392188::CHEMBL541665
SMILES [I-].CC(N)CC[S+](C)C[C@H]1O[C@H]([C@H](O)[C@@H]1O)n1cnc2c(N)ncnc12
InChI Key InChIKey=QIOPICBGKNJCJB-NNFGNQHGSA-N
Data  1 KI
  Tab Delimited (TSV)   2D SDfile   Computed 3D by Vconf -m prep SDfile
Find this compound or compounds like it in BindingDB:
Activity Spreadsheet -- Enzyme Inhibition Constant Data from BindingDB
Found 1 hit for monomerid = 50366972
TargetS-adenosylmethionine decarboxylase proenzyme(Rattus norvegicus)
TBA
Curated by ChEMBL
LigandPNGBDBM50366972(CHEMBL3392188 | CHEMBL541665)
Affinity DataKi:  1.20E+5nM. Assay description: Tested for inhibition against S-adenosyl-L-methionine decarboxylase from rat liver
In DepthDetails ArticlePubMed