BDBM50367078 CHEMBL610704
SMILES NCCCNC[C@H]1OC([C@H](O)[C@@H]1O)n1cnc2c(N)ncnc12
InChI Key InChIKey=MSHFOWYMHIZSJV-RJNFYWFKSA-N
Data  1 KI
  Tab Delimited (TSV)   2D SDfile   Computed 3D by Vconf -m prep SDfile
Find this compound or compounds like it in BindingDB:
Activity Spreadsheet -- Enzyme Inhibition Constant Data from BindingDB
Found 1 hit for monomerid = 50367078
TargetS-adenosylmethionine decarboxylase proenzyme(Rattus norvegicus)
TBA
Curated by ChEMBL
LigandPNGBDBM50367078(CHEMBL610704)
Affinity DataKi:  5.00E+4nM. Assay description: In vitro inhibitory activity against S-adenosyl-L-methionine decarboxylase using liver from rat in presence of 1 mM putrescine
In DepthDetails ArticlePubMed