BDBM50367192 CHEMBL1743860
SMILES CN(C)[C@@H]1CC[C@@H](c2ccc(Cl)cc2)c2ccccc12
InChI Key InChIKey=VBGHDLDPLPNLTB-MAUKXSAKSA-N
Data  3 IC50
  Tab Delimited (TSV)   2D SDfile   Computed 3D by Vconf -m prep SDfile
Find this compound or compounds like it in BindingDB:
Activity Spreadsheet -- Enzyme Inhibition Constant Data from BindingDB
Found 3 hits for monomerid = 50367192
TargetTransporter(Rattus norvegicus)
TBA
Curated by ChEMBL
LigandPNGBDBM50367192(CHEMBL1743860)
Affinity DataIC50:  130nM. Assay description: Inhibition of norepinephrine uptake in synaptosomal preparation fro rat hypothalamus, using [3H]norepinephrine
In DepthDetails ArticlePubMed
TargetSodium-dependent serotonin transporter(Rattus norvegicus (rat))
TBA
Curated by ChEMBL
LigandPNGBDBM50367192(CHEMBL1743860)
Affinity DataIC50:  120nM. Assay description: Inhibition of 5-HT uptake in synaptosomal preparation from rat corpus striatum, using [3H]5-HT
In DepthDetails ArticlePubMed
TargetSodium-dependent dopamine transporter(Rattus norvegicus (rat))
TBA
Curated by ChEMBL
LigandPNGBDBM50367192(CHEMBL1743860)
Affinity DataIC50:  380nM. Assay description: Inhibition of dopamine uptake in synaptosomal preparation in rat corpus striatum, using [3H]dopamine
In DepthDetails ArticlePubMed