BDBM50367798 CHEMBL1202679
SMILES CCCCN(CCCC)CCCCOc1ccc(\C=C\c2nc3ccccc3o2)cc1
InChI Key InChIKey=MLWWLQOUBGZQBT-OBGWFSINSA-N
Data  2 IC50
  Tab Delimited (TSV)   2D SDfile   Computed 3D by Vconf -m prep SDfile
Find this compound or compounds like it in BindingDB:
Activity Spreadsheet -- Enzyme Inhibition Constant Data from BindingDB
Found 2 hits for monomerid = 50367798
TargetPotassium-transporting ATPase alpha chain 1/subunit beta(Homo sapiens (Human))
Ortho Pharmaceutical
Curated by ChEMBL
LigandPNGBDBM50367798(CHEMBL1202679)
Affinity DataIC50:  180nM. Assay description: Antisecretory activity evaluated by the inhibition of 14C -AP uptake in isolated rabbit parietal cells stimulated by exogenous histamine
In DepthDetails ArticlePubMed
TargetPotassium-transporting ATPase alpha chain 1/subunit beta(Homo sapiens (Human))
Ortho Pharmaceutical
Curated by ChEMBL
LigandPNGBDBM50367798(CHEMBL1202679)
Affinity DataIC50: <1.00E+4nM. Assay description: Antisecretory activity evaluated by the inhibition of 14C -AP uptake in isolated rabbit parietal cells stimulated by dibutyryl cyclic adenosine 3', 5...
In DepthDetails ArticlePubMed