BDBM50367921 CHEMBL1790740
SMILES Cc1cn([C@H]2C[C@H](O)[C@@H](CO)O2)c(=O)[nH]c1=S
InChI Key InChIKey=AVKSPBJBGGHUMW-XLPZGREQSA-N
Data  1 KI
  Tab Delimited (TSV)   2D SDfile   Computed 3D by Vconf -m prep SDfile
Find this compound or compounds like it in BindingDB:
Activity Spreadsheet -- Enzyme Inhibition Constant Data from BindingDB
Found 1 hit for monomerid = 50367921
TargetThymidine kinase, cytosolic(Homo sapiens (Human))
Michigan Cancer Foundation
Curated by ChEMBL
LigandPNGBDBM50367921(CHEMBL1790740)
Affinity DataKi:  1.20E+4nM. Assay description: Iinhibitory affect against rabbit thymus thymidine kinase
In DepthDetails ArticlePubMed