BDBM50368290 CHEMBL1790554
SMILES CC[C@@H](C)[C@H](NC(=O)[C@H](C(C)C)[C@@H](O)[C@H](O)[C@H](CC1CCCCC1)NC(=O)[C@H](Cc1cnc[nH]1)NC(=O)CN)C(=O)NCc1ccccn1
InChI Key InChIKey=UBSOHDSAEHUAAU-MPYPKEIPSA-N
Data  1 IC50
  Tab Delimited (TSV)   2D SDfile   Computed 3D by Vconf -m prep SDfile
Find this compound or compounds like it in BindingDB:
Activity Spreadsheet -- Enzyme Inhibition Constant Data from BindingDB
Found 1 hit for monomerid = 50368290
TargetGag-Pol polyprotein [489-587](Human immunodeficiency virus type 1)
Washington University
Curated by ChEMBL
LigandPNGBDBM50368290(CHEMBL1790554)
Affinity DataIC50:  24.8nM. Assay description: Inhibitory potency against HIV-1 protease
In DepthDetails ArticlePubMed