BDBM50369368 CHEMBL1790744
SMILES CCC[C@H](N(C)C[C@@H](NC[C@@H](N)CS)[C@H](C)CC)C(=O)N[C@@H](CCO)C(O)=O
InChI Key InChIKey=HVZJXDZOBBNWBN-UUAJXVIYSA-N
Data  2 IC50
  Tab Delimited (TSV)   2D SDfile   Computed 3D by Vconf -m prep SDfile
Find this compound or compounds like it in BindingDB:
Activity Spreadsheet -- Enzyme Inhibition Constant Data from BindingDB
Found 2 hits for monomerid = 50369368
TargetProtein farnesyltransferase subunit beta/geranylgeranyltransferase type-1 subunit alpha(Homo sapiens (Human))
Merck Research Laboratories
Curated by ChEMBL
LigandPNGBDBM50369368(CHEMBL1790744)
Affinity DataIC50:  21nM. Assay description: Inhibition of [3H]FPP incorporation into recombinant human Ha-Ras by Farnesyltransferase
In DepthDetails ArticlePubMed
LigandPNGBDBM50369368(CHEMBL1790744)
Affinity DataIC50:  4.30E+4nM. Assay description: Inhibition of bovine Geranylgeranyl transferase type I
In DepthDetails ArticlePubMed