BDBM50370046 CHEMBL1744267
SMILES CCC(c1cnc[nH]1)c1sccc1C
InChI Key InChIKey=RHFYCPSMCRFFHU-UHFFFAOYSA-N
Data  1 KI
  Tab Delimited (TSV)   2D SDfile   Computed 3D by Vconf -m prep SDfile
Find this compound or compounds like it in BindingDB:
Activity Spreadsheet -- Enzyme Inhibition Constant Data from BindingDB
Found 1 hit for monomerid = 50370046
TargetAlpha-1D adrenergic receptor(Homo sapiens (Human))
The R. W. Johnson Pharmaceutical Research Institute
Curated by ChEMBL
LigandPNGBDBM50370046(CHEMBL1744267)
Affinity DataKi:  8.30nM. Assay description: In vitro binding affinity against alpha-2D adrenergic receptor of male Wistar rat
In DepthDetails ArticlePubMed