BDBM50370316 CHEMBL272667
SMILES Cc1c2C(=NNc3ccc(cc3)S(N)(=O)=O)C(=O)Nc2ccc1[N+]([O-])=O
InChI Key InChIKey=BSGDITXDAFMGGS-UHFFFAOYSA-N
Data  3 IC50
  Tab Delimited (TSV)   2D SDfile   Computed 3D by Vconf -m prep SDfile
Find this compound or compounds like it in BindingDB:
Activity Spreadsheet -- Enzyme Inhibition Constant Data from BindingDB
Found 3 hits for monomerid = 50370316
TargetCyclin-dependent kinase 1(Homo sapiens (Human))
University Of Zurich
Curated by ChEMBL
LigandPNGBDBM50370316(CHEMBL272667)
Affinity DataIC50:  87nM. Assay description: Inhibition of CDK1
In DepthDetails ArticlePubMed
TargetCyclin-dependent kinase 2(Homo sapiens (Human))
University Of Zurich
Curated by ChEMBL
LigandPNGBDBM50370316(CHEMBL272667)
Affinity DataIC50:  4.60nM. Assay description: Inhibition of CDK2
In DepthDetails ArticlePubMed
TargetCyclin-dependent kinase 2(Homo sapiens (Human))
University Of Zurich
Curated by ChEMBL
LigandPNGBDBM50370316(CHEMBL272667)
Affinity DataIC50:  4.60nM. Assay description: Evaluated for inhibition of human cyclin dependent kinase 2 (CDK2)
In DepthDetails ArticlePubMed