BDBM50371433 CHEMBL402128
SMILES COC(=O)CCCCCNC(=O)[C@H](CCCCN1C[C@H](O)[C@@H](O)[C@H](O)[C@H]1CO)NS(=O)(=O)c1cccc2c(cccc12)N(C)C
InChI Key InChIKey=KIAVOUPXBIKGEF-PBLQPZLJSA-N
Data  1 KI
  Tab Delimited (TSV)   2D SDfile   Computed 3D by Vconf -m prep SDfile
Find this compound or compounds like it in BindingDB:
Activity Spreadsheet -- Enzyme Inhibition Constant Data from BindingDB
Found 1 hit for monomerid = 50371433
TargetBeta-glucosidase(Agrobacterium sp. ATCC 21400)
Technische Universit£T Graz
Curated by ChEMBL
LigandPNGBDBM50371433(CHEMBL402128)
Affinity DataKi:  6.20E+3nM. Assay description: Inhibition of Agrobacterium sp. beta-glucosidase
In DepthDetails ArticlePubMed