BDBM50373031 CHEMBL411263
SMILES FCCOc1ccccc1S[C@H]([C@@H]1CNCCO1)c1ccccc1
InChI Key InChIKey=JTLPJEXKDFZLAY-HKUYNNGSSA-N
Data  3 KI
  Tab Delimited (TSV)   2D SDfile   Computed 3D by Vconf -m prep SDfile
Find this compound or compounds like it in BindingDB:
Activity Spreadsheet -- Enzyme Inhibition Constant Data from BindingDB
Found 3 hits for monomerid = 50373031
TargetSodium-dependent noradrenaline transporter(Homo sapiens (Human))
Emory University
Curated by ChEMBL
LigandPNGBDBM50373031(CHEMBL411263)
Affinity DataKi:  1nM. Assay description: Displacement of [3H]nisoxetine from human NET expressed in HEK293 cells
In DepthDetails ArticlePubMed
TargetSodium-dependent serotonin transporter(Homo sapiens (Human))
Emory University
Curated by ChEMBL
LigandPNGBDBM50373031(CHEMBL411263)
Affinity DataKi:  733nM. Assay description: Displacement of [3H]citalopram from human SERT expressed in HEK293 cells
In DepthDetails ArticlePubMed
TargetSodium-dependent dopamine transporter(Homo sapiens (Human))
Emory University
Curated by ChEMBL
LigandPNGBDBM50373031(CHEMBL411263)
Affinity DataKi: >1.00E+4nM. Assay description: Displacement of [125]RTI35 from human DAT expressed in canine kidney cells
In DepthDetails ArticlePubMed