BDBM50374097 CHEMBL255166
SMILES C(Cc1ccc(cc1)C1=CCC2CN(Cc3ccccc3)CC12)N1CCOCC1
InChI Key InChIKey=UNRGMCLRRBQICS-UHFFFAOYSA-N
Data  1 KI
  Tab Delimited (TSV)   2D SDfile   Computed 3D by Vconf -m prep SDfile
Find this compound or compounds like it in BindingDB:
Activity Spreadsheet -- Enzyme Inhibition Constant Data from BindingDB
Found 1 hit for monomerid = 50374097
TargetHistamine H3 receptor(Rattus norvegicus (rat))
Arena Pharmaceuticals
Curated by ChEMBL
LigandPNGBDBM50374097(CHEMBL255166)
Affinity DataKi:  1.70nM. Assay description: Displacement of N-[3H]methylhistamine from histamine H3 receptor in rat cortex
In DepthDetails ArticlePubMed