BDBM50375164 CHEMBL269821
SMILES [#6]-[#7](-[#6])-c1ccc(\[#6]=[#6]-2/[#6](=O)-[#7]-[#6](=S)-[#7]-[#6]-2=O)cc1
InChI Key InChIKey=UOUVLKPLCQPNES-UHFFFAOYSA-N
Data  1 KI
  Tab Delimited (TSV)   2D SDfile   Computed 3D by Vconf -m prep SDfile
Find this compound or compounds like it in BindingDB:
Activity Spreadsheet -- Enzyme Inhibition Constant Data from BindingDB
Found 1 hit for monomerid = 50375164
TargetMethionine aminopeptidase 1(Homo sapiens (Human))
North Dakota State University
Curated by ChEMBL
LigandPNGBDBM50375164(CHEMBL269821)
Affinity DataKi: >1.00E+5nM. Assay description: Inhibition of human methionine aminopeptidase 1
In DepthDetails ArticlePubMed