BDBM50375182 CHEMBL270596
SMILES Fc1ccc(\[#6]=[#6]-2\[#6](=O)-[#7]-[#6](=S)-[#7]-[#6]-2=O)cc1
InChI Key InChIKey=JHIXUZZXOFGDGE-UHFFFAOYSA-N
Data  1 KI
  Tab Delimited (TSV)   2D SDfile   Computed 3D by Vconf -m prep SDfile
Find this compound or compounds like it in BindingDB:
Activity Spreadsheet -- Enzyme Inhibition Constant Data from BindingDB
Found 1 hit for monomerid = 50375182
TargetMethionine aminopeptidase 1(Homo sapiens (Human))
North Dakota State University
Curated by ChEMBL
LigandPNGBDBM50375182(CHEMBL270596)
Affinity DataKi:  6.00E+3nM. Assay description: Inhibition of human methionine aminopeptidase 1
In DepthDetails ArticlePubMed